nasch-deko's News: Subprocess exited with error. May 4, 2023 · Per scikit-learn’s documentation:. A

Author-36 Lwt Psposvpiw
Jul 16th, 2024

These commands no longer work. a) "fbprophet" is now "prophet". b) need legacy versions of pystan and cmdstanpy. pystan=2.19.1.1 cmdstanpy=0.9.5. My Windows OS fails to install pystan=2.19.1.1 so I have given up. But "pip install prophet" works on both Google Collab and GCP Workbench. Share. Improve this answer.Sep 23, 2023 · I tried to install apex with my terminal and with torch.version = 1.13.1+cu117. I followed the commands and instructions but it did not work. I'm using Python 3.11 self.calc_info() NOT AVAILABLE C:\Users\Alvaro\anaconda3\lib\distutils\dist.py:274: UserWarning: Unknown distribution option: 'define_macros' warnings.warn(msg) running install running build running config_cc unifing config_cc, config, build_clib, build_ext, build commands --compiler options …The subprocess exited with error message is a common issue when using the subprocess module in Python to run external commands or programs. Learn the causes, symptoms, and solutions …Using pip download --platform <platform> will solve you the issue. The list of platform options for the --platform flag in pip may vary depending on the specific packages and versions available in the Python Package Index (PyPI). However, here are some common platform options you may encounter: win32: 32-bit Windows platform.; …I am trying to install pycaret in Google Colab and I am getting this error: error: **subprocess-exited-with-error** × python setup.py egg_info did not run successfully. │ exit code: 1 ╰─&gt; See...Jan 10, 2023 · I ran into this problem recently on a fresh Linux VM, but the solution was actually quite simple. I added the pip version to the install command, e.g. pip3.10 install openai and everything worked as intended. playsound 1.3.0 does not currently have a whl, and the sdist version (.tar.gz) has a bug when installed with pip. If you don't want to wait for the fix and you have git installed, you can install the fixed version from my github.Problem about install the torch bindings for tiny-cuda-nn: "error: subprocess-exited-with-error" 0 Failed to install zbar in wndows for python using pip install zbar. Load 7 more related questions Show fewer related questions Sorted by: Reset to default Know someone who can answer? ...Been trying to get a discord bot running, and I've tried plenty of different ways to install discord.py to no avail. When I try running py -3 -m pip install -U discord.py or its myriad of otherAug 20, 2023 · Saved searches Use saved searches to filter your results more quickly Dec 29, 2022 · Describe the Bug I have a Docker container (python:3 image) in which I want to install scikit-survival. When I arrive at the pip install scikit-survival step, it fails. Install gcc and g++ under ubuntu; sudo apt update sudo apt upgrade sudo add-apt-repository ppa:ubuntu-toolchain-r/test sudo apt update sudo apt install gcc-11 g++-11 Install gcc and g++ under centos; yum install scl-utils yum install centos-release-scl # find devtoolset-11 yum list all --enablerepo='centos-sclo-rh' | grep "devtoolset" yum install -y …Questions and Help Hi, I was trying to build from source, and when I ran pip install -e., I got the following outputs, could you help to have a look please? Traceback (most recent call last): File "setup.py", line 289, in from xformers...Nov 9, 2022 · Thanks for contributing an answer to Stack Overflow! Please be sure to answer the question.Provide details and share your research! But avoid …. Asking for help, clarification, or responding to other answers. 1. First, you should install the following packages using terminal: $ sudo apt-get update $ sudo apt-get install build-essential cmake $ sudo apt-get install libopenblas-dev liblapack-dev $ sudo apt-get install libx11-dev libgtk-3-dev. After that: Use pip3 for Python 3 version or pip by default: pip3 install cmake pip3 install dlib.I am trying to install a package using pip using the following command python -m pip install pysam pyvcf. But it gives the following error; Requirement already satisfied: pysam in ./anaconda3/lib/p...You signed in with another tab or window. Reload to refresh your session. You signed out in another tab or window. Reload to refresh your session. You switched accounts on another tab or window.Teams. Q&A for work. Connect and share knowledge within a single location that is structured and easy to search. Learn more about TeamsYes I have tried it, even that returns exit code 1. – Harwee. May 27, 2016 at 7:16. The advise @Idos gave is a really good one, since it is required to prevent command injection. Never construct commands as strings. To solve the problem you should print cmd and run the program. Using > redirection might need shell=True to be set for check ...Mar 24, 2022 · ERROR: Command errored out with exit status 1: python setup.py egg_info Check the logs for full command output. when trying to install dotenv 5 Python Error: ModuleNotFoundError: No module named 'dotenv' 2. Keep the return value of the subprocess.run call instead of immediately converting it to a str, and do not have check=True. # main.py import subprocess import sys command = [sys.executable, 'task.py'] outcome = subprocess.run (command, check=False, capture_output=True) print (f"returncode = {outcome.returncode}") if outcome.returncode …I am trying to install orjson==3.3.0 on my MacBook Pro with Apple M1 Pro chip running macOS Monterey 12.2.1.. Python version: 3.8.9 Command used: pip install orjson==3.3.0 Error: Collecting orjson==3.3.0 Downloading orjson-3.3.0.tar.gz (654 kB) ━━━━━━━━━━━━━━━━━━━━━━━━━━━━━━━━━━━━━━━━ …Aug 5, 2023 · Teams. Q&A for work. Connect and share knowledge within a single location that is structured and easy to search. Learn more about Teams Jul 19, 2023 · Hello @easyparkingplace, @TetsuakiBaba,. Could you downgrade the pip version by using the below command and restart the run time again:!pip install pip=21.3.1. I could able to import!pip install mediapipe-model-maker successfully by downgrading the pip version as screenshot attached. If you look at the info for the fasttext package at PyPI, it says:. fastText builds on modern Mac OS and Linux distributions. Since it uses C++11 features, it requires a compiler with good C++11 support.

Fortunately, I solved the problem. These are the steps to download face_recognition Library: 1- install python: in the command prompt write python and click Enter, this will open Microsoft store for you, "click download" or "install" to download and install python. "to check if it is downloaded or not type python in the command prompt. 2- …The subprocess exited with error message is a common issue when using the subprocess module in Python to run external commands or programs. Learn the causes, symptoms, and solutions …According to this thread, installing/upgrading wheel worked.. I tried the same with your use case and it worked fine. Here's the sample workflow that I used: name: python_playsound_test on: workflow_dispatch jobs: ci: runs-on: ubuntu-latest strategy: matrix: python-version: ["3.8", "3.9", "3.10"] steps: - name: Set up Python ${{ …To check the status of your virtual environment in pycharm press CTRL + ALT + S at the same time. It will open up a GUI, click the project and be sure to click the drop down and then click the Python Interpreter you will see all the packages installed on your system. If you do not see the pandas package, click the + and search for pandas …Subprocess-exited-with-error: Common Issues and Solutions. If you’ve worked with Python, you may have encountered the dreaded “subprocess-exited-with-error ... Oct 23, 2023 · Teams. Q&A for work. Connect and share knowledge within a single location that is structured and easy to search. Learn more about Teams Mar 24, 2023 · Collecting deepspeed Downloading http://pypi.doubanio.com/packages/b4/7f/f81e601329fd19c5e7beabb472e0a4cb1ede8292b10df715b261f4d3a16b/deepspeed-0.8.2.tar.gz (763 kB) ... Apr 5, 2023 · Ah, if you are using PowerShell you'll want to set the environment variable differently, I assumed that was cmd.exe. For PowerShell can you try Set-Item Env:\DS_BUILD_OPS 0 Jul 31, 2022 · 4 Answers Sorted by: 3 I got this exact same error when trying to run: pip install dotenv After a lot of hunting around, I realised I got the package name wrong. The correct command was: pip install python-dotenv Maybe try googling "pip your-package-name" to find the PyPi page for your package and double check you are using the correct name? Dec 29, 2022 · Describe the Bug I have a Docker container (python:3 image) in which I want to install scikit-survival. When I arrive at the pip install scikit-survival step, it fails. Hello, I am trying to install via pip into a conda environment, with A100 GPU, cuda version 11.6.2. I get the following, not very informative, error: Building wheels for collected packages: flash-a...Teams. Q&A for work. Connect and share knowledge within a single location that is structured and easy to search. Learn more about TeamsYou signed in with another tab or window. Reload to refresh your session. You signed out in another tab or window. Reload to refresh your session. You switched …2. It is not enough to install libmariadb-dev, you also need to install libmariadb (afaik it is libmariadb3 on focal), since mariadb-config binary is not part of the dev package. sudo apt-get install libmariadb3 libmariadb-dev. Another option would be to install the server package, which also contains MariaDB Connector/C.Prerequisite. I have searched Issues and Discussions but cannot get the expected help.; I have read the FAQ documentation but cannot get the expected help.; The bug has not been fixed in the latest version (dev) or latest version (1.x).; Task. I'm using the official example scripts/configs for the officially supported tasks/models/datasets.Install gcc and g++ under ubuntu; sudo apt update sudo apt upgrade sudo add-apt-repository ppa:ubuntu-toolchain-r/test sudo apt update sudo apt install gcc-11 g++-11 Install gcc and g++ under centos; yum install scl-utils yum install centos-release-scl # find devtoolset-11 yum list all --enablerepo='centos-sclo-rh' | grep "devtoolset" yum install -y …

wkntqx

Apr 21, 2022 · I tried doing &quot;conda install -c conda-forge cartopy in an anaconda prompt, but that does not do anything even though it says done. In my command prompt, I try pip install cartopy and the messa... Teams. Q&A for work. Connect and share knowledge within a single location that is structured and easy to search. Learn more about TeamsOct 7, 2023 · Been trying to get a discord bot running, and I've tried plenty of different ways to install discord.py to no avail. When I try running py -3 -m pip install -U discord.py or its myriad of other Teams. Q&A for work. Connect and share knowledge within a single location that is structured and easy to search. Learn more about TeamsYou signed in with another tab or window. Reload to refresh your session. You signed out in another tab or window. Reload to refresh your session. You switched …Mar 7, 2023 · Teams. Q&A for work. Connect and share knowledge within a single location that is structured and easy to search. Learn more about Teams Ubuntu is using glibc, no need to install musl-dev.. Notice you're running python3 -m pip install --upgrade pip before running update-alternatives. This means you upgraded pip to the latest 23.2.1 for Python 3.10, but for Python 3.11 the apt-provided pip 22.0.2 is still used.. Run update-alternatives before updating pip to actually have an up-to …Yes I have tried it, even that returns exit code 1. – Harwee. May 27, 2016 at 7:16. The advise @Idos gave is a really good one, since it is required to prevent command injection. Never construct commands as strings. To solve the problem you should print cmd and run the program. Using > redirection might need shell=True to be set for check ...MRAB (Matthew Barnett) April 24, 2023, 3:01am 5. As @TeamSpen210 said, “Visual Studio Code” is not the same thing as “Visual Studio”. It’s asking for “Visual Studio”. pip install dlib Collecting dlib Using cached dlib-19.24.1.tar.gz (3.2 MB) Preparing metadata (setup.py) … done Building wheels for collected packages: dlib ...Jul 31, 2022 · 4 Answers Sorted by: 3 I got this exact same error when trying to run: pip install dotenv After a lot of hunting around, I realised I got the package name wrong. The correct command was: pip install python-dotenv Maybe try googling "pip your-package-name" to find the PyPi page for your package and double check you are using the correct name? According to this thread, installing/upgrading wheel worked.. I tried the same with your use case and it worked fine. Here's the sample workflow that I used: name: python_playsound_test on: workflow_dispatch jobs: ci: runs-on: ubuntu-latest strategy: matrix: python-version: ["3.8", "3.9", "3.10"] steps: - name: Set up Python ${{ …Try running your subprocess this way! import os import subprocess env = os.environ.copy () subprocess.run (cmd, shell=True, env=env) This works for me. I find that this works for all OS. Do not add ! inside cmd. After a few hours of trial and error, a simple documentation search on Colab's page gave me the answer. Jul 27, 2023 · Hi all, I am trying to install pip install “ai-core-sdk[aicore-content]” while building meter reading model ,so i am following a blog , while executing command to install ai core sdk on virtual machine linux , I am fac&hellip; Jun 7, 2023 · SOLUTION FOR DOCKER USERS ONLY: Step 1: For Docker Compose users: Add the following to the Home Assistant container section of your docker-compose.yaml file The error: subprocess-exited-with-error occurs when Python fails to execute a subprocess successfully. Most likely, pip encountered a problem when running the setup.pyscript. To resolve this error, you need to make sure the required build tools are installed, the package supports the operating system you … See moreFeb 11, 2023 · To solve the error "subprocess-exited-with-error: This error originates from a subprocess, and is likely not a problem with pip": Upgrade your versions of pip, setuptools and wheel. Make sure you haven't got any missing dependencies. Make sure your Python version is supported by the package. shell Teams. Q&A for work. Connect and share knowledge within a single location that is structured and easy to search. Learn more about Teams

ERROR: No matching distribution found for setuptools_scm Traceback (most recent call last): File "C:\Users\ioriliao\AppData\Roaming\Python\Python39\site-packages\setuptools\installer.py", line 82, in fetch_build_egg Ah, if you are using PowerShell you'll want to set the environment variable differently, I assumed that was cmd.exe. For PowerShell can you try Set-Item Env:\DS_BUILD_OPS 0. After setting it up this way, the compilation didn't take place and the directly generated .whl file couldn't be installed.Hi everyone ! I have spent a lot of time trying to install llama-cpp-python with GPU support. I need your help. I'll keep monitoring the thread and if I need to try other options and provide info post and I'll send everything quickly. I ...I am using a Python virtual environment to work on a project. After setting up my venv and pulling from git I tried to pip install -r requirements.txt but am getting the following error: CollectingThe subprocess exited with error message is a common issue when using the subprocess module in Python to run external commands or programs. Learn the causes, symptoms, and solutions …2 Answers Sorted by: 6 Try installing/upgrading wheel: pip install --upgrade wheel This worked for me. Share Improve this answer Follow edited Jul 4, 2023 at 18:39 …I got the some issue when I was trying to download Flask-SQLAlchemy; I used the code below in my terminal and it worked: pip install --only-binary :all: greenlet …Saved searches Use saved searches to filter your results more quicklyTeams. Q&A for work. Connect and share knowledge within a single location that is structured and easy to search. Learn more about TeamsI have an MacBook Pro with M1 Pro chip and I had the same problem as you. For the moment the only solution I found is to use an environment with conda.Jul 27, 2023 · Hi all, I am trying to install pip install “ai-core-sdk[aicore-content]” while building meter reading model ,so i am following a blog , while executing command to install ai core sdk on virtual machine linux , I am fac&hellip; Sep 12, 2022 · Thanks for contributing an answer to Stack Overflow! Please be sure to answer the question.Provide details and share your research! But avoid …. Asking for help, clarification, or responding to other answers. Thanks for contributing an answer to Stack Overflow! Please be sure to answer the question.Provide details and share your research! But avoid …. Asking for help, clarification, or responding to other answers.

I solved the issue, First Update. apt update apt-get install build-essential libssl-dev l!

So the package is libpq-dev.Now, reinstalling it will get everything to the default state i.e. all relevant files will be copied to the right places. As it is only a library package, no user/system level configurations will be overridden (and dpkg will prompt you for action for any package that does that).. To reinstall the package:Jun 16, 2023 · @VIJAY Sahu (UK) - Just checking in to see if the below answer helped. If this answers your query, do click Accept Answer and Yes for was this answer helpful. And, if you have any further query do let us know.

Description Environment: Windows 10, msys2, python 3.9, pip 22.3, venv pip install psycopg2, pip install psycopg2-binary both failed. Expected behavior No response pip version 22.3.1 Python version 3.9.11 OS Windows 10 How to Reproduce U...Hi @Annieliaquat,. We are aware of this issue and pip install tf-models-official is breaking as of now because of latest cython and pyyaml release having some version conflicts, as of now we are taking cython latest version and pyyaml <6.0 version.Hi hassan issa, glad to know you've found the solution to resolve this issue! you could click ' ' to mark it as an answer to change its status to Answered.

Aug 10, 2022 · Yesterday I started a project with a voice assistant, but stumbled on PyAudio :((I tried a lot of different things, as QUANTUM says, but when I tried what WKL recommends, everything fell into place! Installation check I have read the installation guide. Platform 'Linux-4.9.117+-aarch64-with-libc' Installation Method pip install pandas Version Latest Python Version Latest Installation Logs I can install numpy in isolation, but when I...

Map of tour stops

All Comments (66)

Profile Image 3
Nftn Exjydmdygfm
Commented on Jul 13th, 2024
Installing sd-webui-segment-anything requirement: groundingdino 提示:SD-WebUI 正在联网同步内部组件,这可能需要几秒到几十分钟不等 ...
Profile Image 89
Pwnxjg Dhycnio
Commented on Jul 15th, 2024
Teams. Q&A for work. Connect and share knowledge within a single location that is structured and easy to search. Learn more about Teams
Profile Image 1
Alnc Nyasyajovov
Commented on Jul 06th, 2024
12 Essentially, I am trying to use a subprocess call to checkout a git commit at a specific sha hash. However, I keep getting the error …
Profile Image 6
Cocfuw Ourzmeatr
Commented on Jul 10th, 2024
Thanks for contributing an answer to Stack Overflow! Please be sure to answer the question.Provide details and share your research! But avoid …. Asking for help, clarification, or responding to other answers.